Target
Epithelial discoidin domain-containing receptor 1
Ligand
BDBM401038
Substrate
Meas. Tech.
LanthaScreen Assay
IC50
12.0±n/a nM
Citation
 Murata, THara, SNiizuma, SHada, KKawada, HSakaitani, MShimada, HNakanishi, Y Quinazolinone and isoquinolinone derivative US Patent  US10005739 Publication Date 6/26/2018 
Target
Name:
Epithelial discoidin domain-containing receptor 1
Synonyms:
CAK DDR1_HUMAN Discoidin domain-containing receptor 1 (DDR1) EDDR1 Epithelial discoidin domain receptor 1 (DDR1) Epithelial discoidin domain-containing receptor 1 (DDR1) Mammary carcinoma kinase 10 NTRK4 Protein-tyrosine kinase RTK 6 TRKE | Tyrosine-protein kinase CAK
Type:
Tyrosine-protein kinase
Mol. Mass.:
101130.02
Organism:
Homo sapiens (Human)
Description:
Q08345
Residue:
913
  
Inhibitor
Name:
BDBM401038
Synonyms:
A-12 | US10005739, Example 164
Type:
Small organic molecule
Emp. Form.:
C17H12Cl2F3N3O3S
Mol. Mass.:
466.262
SMILES:
CCS(=O)(=O)c1ccc(Cl)cc1Nn1cnc2c(Cl)cc(cc2c1=O)C(F)(F)F
: