Target
Epithelial discoidin domain-containing receptor 1
Ligand
BDBM401049
Substrate
Meas. Tech.
LanthaScreen Assay
IC50
32.0±n/a nM
Citation
 Murata, THara, SNiizuma, SHada, KKawada, HSakaitani, MShimada, HNakanishi, Y Quinazolinone and isoquinolinone derivative US Patent  US10005739 Publication Date 6/26/2018 
Target
Name:
Epithelial discoidin domain-containing receptor 1
Synonyms:
CAK DDR1_HUMAN Discoidin domain-containing receptor 1 (DDR1) EDDR1 Epithelial discoidin domain receptor 1 (DDR1) Epithelial discoidin domain-containing receptor 1 (DDR1) Mammary carcinoma kinase 10 NTRK4 Protein-tyrosine kinase RTK 6 TRKE | Tyrosine-protein kinase CAK
Type:
Tyrosine-protein kinase
Mol. Mass.:
101130.02
Organism:
Homo sapiens (Human)
Description:
Q08345
Residue:
913
  
Inhibitor
Name:
BDBM401049
Synonyms:
8-Bromo-3-(5-chloro-2-cyclopropylsulfonylanilino)-6-(trifluoromethyl)quinazolin-4-one | US10005739, Example 239
Type:
Small organic molecule
Emp. Form.:
C18H12BrClF3N3O3S
Mol. Mass.:
522.723
SMILES:
FC(F)(F)c1cc(Br)c2ncn(Nc3cc(Cl)ccc3S(=O)(=O)C3CC3)c(=O)c2c1
: