Target
Epithelial discoidin domain-containing receptor 1
Ligand
BDBM401223
Substrate
Meas. Tech.
LanthaScreen Assay
IC50
29.0±n/a nM
Citation
 Murata, THara, SNiizuma, SHada, KKawada, HSakaitani, MShimada, HNakanishi, Y Quinazolinone and isoquinolinone derivative US Patent  US10005739 Publication Date 6/26/2018 
Target
Name:
Epithelial discoidin domain-containing receptor 1
Synonyms:
CAK DDR1_HUMAN Discoidin domain-containing receptor 1 (DDR1) EDDR1 Epithelial discoidin domain receptor 1 (DDR1) Epithelial discoidin domain-containing receptor 1 (DDR1) Mammary carcinoma kinase 10 NTRK4 Protein-tyrosine kinase RTK 6 TRKE | Tyrosine-protein kinase CAK
Type:
Tyrosine-protein kinase
Mol. Mass.:
101130.02
Organism:
Homo sapiens (Human)
Description:
Q08345
Residue:
913
  
Inhibitor
Name:
BDBM401223
Synonyms:
7-[[(3S)-3-(Aminomethyl)pyrrolidin-1-yl]methyl]-8-chloro-3-[(5-chloro-2-ethylsulfonylphenyl)methyl]-6-(trifluoromethoxy)quinazolin-4-one | US10005739, Example 662
Type:
Small organic molecule
Emp. Form.:
C24H25Cl2F3N4O4S
Mol. Mass.:
593.446
SMILES:
CCS(=O)(=O)c1ccc(Cl)cc1Cn1cnc2c(Cl)c(CN3CC[C@@H](CN)C3)c(OC(F)(F)F)cc2c1=O
: