Target
Protein kinase C theta type
Ligand
BDBM35119
Substrate
PKC Peptide Substrate
Meas. Tech.
PKC IMAP Kinase Assay
pH
7.2±n/a
Temperature
295.15±n/a K
IC50
51±6.1 nM
Citation
 Tumey, LNBhagirath, NBrennan, ABrooijmans, NLee, JYang, XBoschelli, DH 5-Vinyl-3-pyridinecarbonitrile inhibitors of PKCtheta: optimization of enzymatic and functional activity. Bioorg Med Chem 17:7933-48 (2009)  
Target
Name:
Protein kinase C theta type
Synonyms:
KPCT_HUMAN PRKCT Protein kinase C theta type (PRKCQ) nPKC-theta
Type:
Serine/threonine-protein kinase
Mol. Mass.:
81878.04
Organism:
Homo sapiens (Human)
Description:
Full-length human PKC theta (Panvera Catalog No. P2996).
Residue:
706
  
Inhibitor
Name:
BDBM35119
Synonyms:
5-vinyl-3-pyridinecarbonitrile, 11a
Type:
Small organic molecule
Emp. Form.:
C22H23N5O
Mol. Mass.:
373.4509
SMILES:
Cc1c(Nc2c(\C=C\CN3CCOCC3)cncc2C#N)ccc2[nH]ccc12
:
Substrate
Name:
PKC Peptide Substrate
Synonyms:
Type:
Fluorescent peptide
Mol. Mass.:
2051.95
Organism:
Description:
Residue:
17
FAMRFARKGSLRQKNVH