Target
Methionine aminopeptidase 2
Ligand
BDBM401250
Substrate
Meas. Tech.
Activity Assay
IC50
83.0±n/a nM
Citation
 Heinrich, TZenke, FRohdich, FFriese-Hamim, MHahn, D Pyrrolidinone derivatives as MetAP-2 inhibitors US Patent  US10005756 Publication Date 6/26/2018 
Target
Name:
Methionine aminopeptidase 2
Synonyms:
Initiation factor 2-associated 67 kDa glycoprotein MAP2_HUMAN MNPEP Methionine aminopeptidase 2 (MetAP2) P67EIF2 p67
Type:
Enzyme
Mol. Mass.:
52884.45
Organism:
Homo sapiens (Human)
Description:
P50579
Residue:
478
  
Inhibitor
Name:
BDBM401250
Synonyms:
US10005756, Compound A11
Type:
Small organic molecule
Emp. Form.:
C23H19ClFN5O4
Mol. Mass.:
483.879
SMILES:
Cc1nc(no1)-c1cc2cc(ccc2[nH]1)N1CC[C@](O)(C(=O)NCc2cc(F)cc(Cl)c2)C1=O
: