Target
Leucyl-cystinyl aminopeptidase
Ligand
BDBM401337
Substrate
Meas. Tech.
Inhibition Assay
IC50
20.0±n/a nM
Citation
 Kawaguchi, KIshihata, AKanai, ATsuchiya, KInagaki, YKazami, JMorikawa, HHiramoto, MEnjo, KTakamatsu, H Pyridine derivatives US Patent  US10005762 Publication Date 6/26/2018 
Target
Name:
Leucyl-cystinyl aminopeptidase
Synonyms:
Cystinyl aminopeptidase Insulin-regulated membrane aminopeptidase Irap Leucyl-cystinyl aminopeptidase Otase P-LAP Vesicle protein of 165 kDa | Vp165
Type:
PROTEIN
Mol. Mass.:
117179.39
Organism:
Rattus norvegicus
Description:
ChEMBL_98523
Residue:
1025
  
Inhibitor
Name:
BDBM401337
Synonyms:
US10005762, Example 17
Type:
Small organic molecule
Emp. Form.:
C21H32N2O3
Mol. Mass.:
360.4904
SMILES:
CC(C)C[C@H](N)[C@](O)(Cc1cc2[C@@H](CCC3CC3)CCc2cn1)C(O)=O
: