Target
Leucyl-cystinyl aminopeptidase
Ligand
BDBM401374
Substrate
Meas. Tech.
Inhibition Assay
IC50
12.0±n/a nM
Citation
 Kawaguchi, KIshihata, AKanai, ATsuchiya, KInagaki, YKazami, JMorikawa, HHiramoto, MEnjo, KTakamatsu, H Pyridine derivatives US Patent  US10005762 Publication Date 6/26/2018 
Target
Name:
Leucyl-cystinyl aminopeptidase
Synonyms:
Aminopeptidase Cystinyl aminopeptidase Insulin-regulated membrane aminopeptidase LCAP_HUMAN Leucyl-cystinyl aminopeptidase, pregnancy serum form Oxytocinase Placental leucine aminopeptidase
Type:
PROTEIN
Mol. Mass.:
117334.10
Organism:
Homo sapiens (Human)
Description:
ChEMBL_1473494
Residue:
1025
  
Inhibitor
Name:
BDBM401374
Synonyms:
US10005762, Example 54
Type:
Small organic molecule
Emp. Form.:
C20H30N2O3
Mol. Mass.:
346.4638
SMILES:
CC(C)C[C@H](N)[C@](O)(Cc1nccc2C[C@@H](CC3CC3)Cc12)C(O)=O
: