Target
Leucyl-cystinyl aminopeptidase
Ligand
BDBM401378
Substrate
Meas. Tech.
Inhibition Assay
IC50
17.0±n/a nM
Citation
 Kawaguchi, KIshihata, AKanai, ATsuchiya, KInagaki, YKazami, JMorikawa, HHiramoto, MEnjo, KTakamatsu, H Pyridine derivatives US Patent  US10005762 Publication Date 6/26/2018 
Target
Name:
Leucyl-cystinyl aminopeptidase
Synonyms:
Aminopeptidase Cystinyl aminopeptidase Insulin-regulated membrane aminopeptidase LCAP_HUMAN Leucyl-cystinyl aminopeptidase, pregnancy serum form Oxytocinase Placental leucine aminopeptidase
Type:
PROTEIN
Mol. Mass.:
117334.10
Organism:
Homo sapiens (Human)
Description:
ChEMBL_1473494
Residue:
1025
  
Inhibitor
Name:
BDBM401378
Synonyms:
US10005762, Example 58
Type:
Small organic molecule
Emp. Form.:
C19H28N2O3
Mol. Mass.:
332.4372
SMILES:
CC(C)C[C@H](N)[C@](O)(Cc1cc(ccn1)C1=CCCCC1)C(O)=O
: