Target
Leucyl-cystinyl aminopeptidase
Ligand
BDBM401379
Substrate
Meas. Tech.
Inhibition Assay
IC50
110±n/a nM
Citation
 Kawaguchi, KIshihata, AKanai, ATsuchiya, KInagaki, YKazami, JMorikawa, HHiramoto, MEnjo, KTakamatsu, H Pyridine derivatives US Patent  US10005762 Publication Date 6/26/2018 
Target
Name:
Leucyl-cystinyl aminopeptidase
Synonyms:
Cystinyl aminopeptidase Insulin-regulated membrane aminopeptidase Irap Leucyl-cystinyl aminopeptidase Otase P-LAP Vesicle protein of 165 kDa | Vp165
Type:
PROTEIN
Mol. Mass.:
117179.39
Organism:
Rattus norvegicus
Description:
ChEMBL_98523
Residue:
1025
  
Inhibitor
Name:
BDBM401379
Synonyms:
US10005762, Example 59
Type:
Small organic molecule
Emp. Form.:
C18H26N2O4
Mol. Mass.:
334.41
SMILES:
CC(C)C[C@H](N)[C@](O)(Cc1cc(ccn1)C1=CCOCC1)C(O)=O
: