Target
Leucyl-cystinyl aminopeptidase
Ligand
BDBM401383
Substrate
Meas. Tech.
Inhibition Assay
IC50
14.0±n/a nM
Citation
 Kawaguchi, KIshihata, AKanai, ATsuchiya, KInagaki, YKazami, JMorikawa, HHiramoto, MEnjo, KTakamatsu, H Pyridine derivatives US Patent  US10005762 Publication Date 6/26/2018 
Target
Name:
Leucyl-cystinyl aminopeptidase
Synonyms:
Aminopeptidase Cystinyl aminopeptidase Insulin-regulated membrane aminopeptidase LCAP_HUMAN Leucyl-cystinyl aminopeptidase, pregnancy serum form Oxytocinase Placental leucine aminopeptidase
Type:
PROTEIN
Mol. Mass.:
117334.10
Organism:
Homo sapiens (Human)
Description:
ChEMBL_1473494
Residue:
1025
  
Inhibitor
Name:
BDBM401383
Synonyms:
US10005762, Example 63
Type:
Small organic molecule
Emp. Form.:
C19H30N2O3
Mol. Mass.:
334.4531
SMILES:
CCC1CCc2c(C1)ccnc2C[C@@](O)([C@@H](N)CC(C)C)C(O)=O
: