Target
Sodium channel protein type 9 subunit alpha
Ligand
BDBM401454
Substrate
Meas. Tech.
FLIPR Assay
IC50
>20000±n/a nM
Citation
 Yao, JTafesse, L Carboxamide derivatives and use thereof US Patent  US10005768 Publication Date 6/26/2018 
Target
Name:
Sodium channel protein type 9 subunit alpha
Synonyms:
NENA Peripheral sodium channel 1 SCN9A_HUMAN Voltage-gated sodium channel subunit Nav1.7 hNE-Na
Type:
Protein
Mol. Mass.:
226375.97
Organism:
Homo sapiens (Human)
Description:
Q15858
Residue:
1988
  
Inhibitor
Name:
BDBM401454
Synonyms:
6-(4-(2-(1-hydroxy-2-(3- oxopiperazin-1-yl)ethyl)-4- (trifluoromethyl)phenoxy)phenyl) picolinamide | US10005768, Compound 79
Type:
Small organic molecule
Emp. Form.:
C25H23F3N4O4
Mol. Mass.:
500.4697
SMILES:
NC(=O)c1cccc(n1)-c1ccc(Oc2ccc(cc2C(O)CN2CCNC(=O)C2)C(F)(F)F)cc1
: