Target
Sodium channel protein type 9 subunit alpha
Ligand
BDBM401467
Substrate
Meas. Tech.
FLIPR Assay
IC50
>20000±n/a nM
Citation
 Yao, JTafesse, L Carboxamide derivatives and use thereof US Patent  US10005768 Publication Date 6/26/2018 
Target
Name:
Sodium channel protein type 9 subunit alpha
Synonyms:
NENA Peripheral sodium channel 1 SCN9A_HUMAN Voltage-gated sodium channel subunit Nav1.7 hNE-Na
Type:
Protein
Mol. Mass.:
226375.97
Organism:
Homo sapiens (Human)
Description:
Q15858
Residue:
1988
  
Inhibitor
Name:
BDBM401467
Synonyms:
6-(3-((4-chloro-2- iodophenoxy)methyl)-4-(4- fluorophenoxy)phenyl) picolinamide | US10005768, Compound 94
Type:
Small organic molecule
Emp. Form.:
C25H17ClFIN2O3
Mol. Mass.:
574.77
SMILES:
NC(=O)c1cccc(n1)-c1ccc(Oc2ccc(F)cc2)c(COc2ccc(Cl)cc2I)c1
: