Target
Sodium channel protein type 9 subunit alpha
Ligand
BDBM401513
Substrate
Meas. Tech.
FLIPR Assay
IC50
684±34 nM
Citation
 Yao, JTafesse, L Carboxamide derivatives and use thereof US Patent  US10005768 Publication Date 6/26/2018 
Target
Name:
Sodium channel protein type 9 subunit alpha
Synonyms:
NENA Peripheral sodium channel 1 SCN9A_HUMAN Voltage-gated sodium channel subunit Nav1.7 hNE-Na
Type:
Protein
Mol. Mass.:
226375.97
Organism:
Homo sapiens (Human)
Description:
Q15858
Residue:
1988
  
Inhibitor
Name:
BDBM401513
Synonyms:
(S)-2-(4-(2-(2- (dimethylamino)pyrimidin-5-yl)- 4- (trifluoromethyl)phenoxy)phenyl)- 6-((2-oxopyrrolidin-3- yl)amino)pyrimidine-4- carboxamide | US10005768, Compound 128
Type:
Small organic molecule
Emp. Form.:
C28H25F3N8O3
Mol. Mass.:
578.5451
SMILES:
CN(C)c1ncc(cn1)-c1cc(ccc1Oc1ccc(cc1)-c1nc(N[C@H]2CCNC2=O)cc(n1)C(N)=O)C(F)(F)F
: