Target
Dual specificity tyrosine-phosphorylation-regulated kinase 1B
Ligand
BDBM401558
Substrate
Meas. Tech.
Kinase Assay
IC50
0.852±n/a nM
Citation
 Leban, JZaja, M 2,3-dihydrobenzofuran-5YL compounds as DYRK kinase inhibitors US Patent  US10005769 Publication Date 6/26/2018 
Target
Name:
Dual specificity tyrosine-phosphorylation-regulated kinase 1B
Synonyms:
DYR1B_HUMAN Dual specificity tyrosine-phosphorylation-regulated kinase 1B MIRK
Type:
Enzyme
Mol. Mass.:
69222.24
Organism:
Homo sapiens (Human)
Description:
Q9Y463
Residue:
629
  
Inhibitor
Name:
BDBM401558
Synonyms:
US10005769, No. 22
Type:
Small organic molecule
Emp. Form.:
C24H21N5O3S
Mol. Mass.:
459.52
SMILES:
O=C(Nc1nc2cc(ccc2[nH]1)C(=O)N1CCCC1)c1csc(n1)-c1ccc2OCCc2c1
: