Target
Dual specificity tyrosine-phosphorylation-regulated kinase 1B
Ligand
BDBM401577
Substrate
Meas. Tech.
Kinase Assay
IC50
19.5±n/a nM
Citation
 Leban, JZaja, M 2,3-dihydrobenzofuran-5YL compounds as DYRK kinase inhibitors US Patent  US10005769 Publication Date 6/26/2018 
Target
Name:
Dual specificity tyrosine-phosphorylation-regulated kinase 1B
Synonyms:
DYR1B_HUMAN Dual specificity tyrosine-phosphorylation-regulated kinase 1B MIRK
Type:
Enzyme
Mol. Mass.:
69222.24
Organism:
Homo sapiens (Human)
Description:
Q9Y463
Residue:
629
  
Inhibitor
Name:
BDBM401577
Synonyms:
US10005769, No. 41
Type:
Small organic molecule
Emp. Form.:
C24H23N5O2S2
Mol. Mass.:
477.602
SMILES:
CN1CCN(CC1)c1ccc2nc(NC(=O)c3csc(n3)-c3ccc4OCCc4c3)sc2c1
: