Target
Dual specificity tyrosine-phosphorylation-regulated kinase 1B
Ligand
BDBM401580
Substrate
Meas. Tech.
Kinase Assay
IC50
60.1±n/a nM
Citation
 Leban, JZaja, M 2,3-dihydrobenzofuran-5YL compounds as DYRK kinase inhibitors US Patent  US10005769 Publication Date 6/26/2018 
Target
Name:
Dual specificity tyrosine-phosphorylation-regulated kinase 1B
Synonyms:
DYR1B_HUMAN Dual specificity tyrosine-phosphorylation-regulated kinase 1B MIRK
Type:
Enzyme
Mol. Mass.:
69222.24
Organism:
Homo sapiens (Human)
Description:
Q9Y463
Residue:
629
  
Inhibitor
Name:
BDBM401580
Synonyms:
US10005769, No. 44
Type:
Small organic molecule
Emp. Form.:
C15H13N5O2S
Mol. Mass.:
327.361
SMILES:
Cc1n[nH]c(NC(=O)c2csc(n2)-c2ccc3OCCc3c2)n1
: