Target
Dual specificity tyrosine-phosphorylation-regulated kinase 1B
Ligand
BDBM401611
Substrate
Meas. Tech.
Kinase Assay
IC50
135±n/a nM
Citation
 Leban, JZaja, M 2,3-dihydrobenzofuran-5YL compounds as DYRK kinase inhibitors US Patent  US10005769 Publication Date 6/26/2018 
Target
Name:
Dual specificity tyrosine-phosphorylation-regulated kinase 1B
Synonyms:
DYR1B_HUMAN Dual specificity tyrosine-phosphorylation-regulated kinase 1B MIRK
Type:
Enzyme
Mol. Mass.:
69222.24
Organism:
Homo sapiens (Human)
Description:
Q9Y463
Residue:
629
  
Inhibitor
Name:
BDBM401611
Synonyms:
US10005769, No. 75
Type:
Small organic molecule
Emp. Form.:
C19H13N3O2S2
Mol. Mass.:
379.455
SMILES:
O=C(Nc1nc2ccccc2s1)c1csc(n1)-c1ccc2OCCc2c1
: