Target
Caspase-3
Ligand
BDBM35198
Substrate
BDBM35191
Meas. Tech.
Caspase-3 Inhibition Assay
pH
7.2±n/a
Temperature
296.15±n/a K
IC50
82±6 nM
Citation
 Havran, LMChong, DCChilders, WEDollings, PJDietrich, AHarrison, BLMarathias, VTawa, GAulabaugh, ACowling, RKapoor, BXu, WMosyak, LMoy, FHum, WTWood, ARobichaud, AJ 3,4-Dihydropyrimido(1,2-a)indol-10(2H)-ones as potent non-peptidic inhibitors of caspase-3. Bioorg Med Chem 17:7755-68 (2009)  
Target
Name:
Caspase-3
Synonyms:
Apopain CASP3 CPP-32 Caspase 3 Caspase-3 subunit p17 SCA-1 Yama protein | caspase-3 preproprotein
Type:
Hydrolase; heterotetramer of two heterodimers
Mol. Mass.:
31607.55
Organism:
Homo sapiens (Human)
Description:
Residue:
277
  
Inhibitor
Name:
BDBM35198
Synonyms:
pyrimidoindolone, 11g
Type:
Small organic molecule
Emp. Form.:
C25H28ClN3O5S
Mol. Mass.:
518.025
SMILES:
COc1ccc(OC[C@@H]2CCCN2S(=O)(=O)c2ccc3N4CC(C)(C)CN=C4C(=O)c3c2)c(Cl)c1
:
Substrate
Name:
BDBM35191
Synonyms:
Ac-DEVD-AFC | N-acetylaspartyl- glutamyl-valyl-aspartate-7-amino-4-trifluoromethyl coumarin
Type:
internally quenched fluorescent substrate
Emp. Form.:
Mol. Mass.:
SMILES:
: