Target
Tyrosine-protein kinase BTK
Ligand
BDBM249995
Substrate
Meas. Tech.
Kinase Assay
IC50
0.360±n/a nM
Citation
 Wang, ZGuo, Y Substituted pyrazolo[1,5-a]pyrimidines as bruton's tyrosine kinase modulators US Patent  US10005782 Publication Date 6/26/2018 
Target
Name:
Tyrosine-protein kinase BTK
Synonyms:
AGMX1 Agammaglobulinaemia tyrosine kinase B cell progenitor kinase BPK BTK_HUMAN Tyrosine Kinase BTK Tyrosine-protein kinase BTK (BTK)
Type:
Enzyme
Mol. Mass.:
76289.95
Organism:
Homo sapiens (Human)
Description:
Q06187
Residue:
659
  
Inhibitor
Name:
BDBM249995
Synonyms:
US10005782, Compound 121 US9556188, Compound 121
Type:
Small organic molecule
Emp. Form.:
C25H23N5O3
Mol. Mass.:
441.4818
SMILES:
NC(=O)c1c(nn2c3CCN(CCc3[nH]c12)C(=O)C=C)-c1ccc(Oc2ccccc2)cc1
: