Target
Tyrosine-protein kinase BTK
Ligand
BDBM250007
Substrate
Meas. Tech.
Kinase Assay
IC50
0.530±n/a nM
Citation
 Wang, ZGuo, Y Substituted pyrazolo[1,5-a]pyrimidines as bruton's tyrosine kinase modulators US Patent  US10005782 Publication Date 6/26/2018 
Target
Name:
Tyrosine-protein kinase BTK
Synonyms:
AGMX1 Agammaglobulinaemia tyrosine kinase B cell progenitor kinase BPK BTK_HUMAN Tyrosine Kinase BTK Tyrosine-protein kinase BTK (BTK)
Type:
Enzyme
Mol. Mass.:
76289.95
Organism:
Homo sapiens (Human)
Description:
Q06187
Residue:
659
  
Inhibitor
Name:
BDBM250007
Synonyms:
US10005782, Compound 133b US9556188, Compound 133b
Type:
Small organic molecule
Emp. Form.:
C24H25N5O3
Mol. Mass.:
431.487
SMILES:
COc1cc(ccc1C)-c1nn2C(CCNc2c1C(N)=O)c1ccccc1NC(=O)C=C
: