Target
5-hydroxytryptamine receptor 2C
Ligand
BDBM35247
Substrate
BDBM28582
Meas. Tech.
Norepinephrine Uptake Assay (IC50)
Ki
2400±n/a nM
Citation
 Heffernan, GDCoghlan, RDManas, ESMcDevitt, RELi, YMahaney, PERobichaud, AJHuselton, CAlfinito, PBray, JACosmi, SAJohnston, GHKenney, TKoury, EWinneker, RCDeecher, DCTrybulski, EJ Dual acting norepinephrine reuptake inhibitors and 5-HT(2A) receptor antagonists: Identification, synthesis and activity of novel 4-aminoethyl-3-(phenylsulfonyl)-1H-indoles. Bioorg Med Chem 17:7802-15 (2009)  
Target
Name:
5-hydroxytryptamine receptor 2C
Synonyms:
5-HT-2C 5-HT2C-INI 5-HTR2C 5-hydroxytryptamine receptor 2C (5-HT-2C) 5HT-1C HTR1C Serotonin (5-HT3) receptor Serotonin Receptor 2C
Type:
G Protein-Coupled Receptor (GPCR)
Mol. Mass.:
51836.79
Organism:
Homo sapiens (Human)
Description:
P28335
Residue:
458
  
Inhibitor
Name:
BDBM35247
Synonyms:
3-(phenylsulfonyl)-1H-indole, 18i
Type:
Small organic molecule
Emp. Form.:
C21H24N2O2S
Mol. Mass.:
368.492
SMILES:
O=S(=O)(c1c[nH]c2cccc(CCN3CCCCC3)c12)c1ccccc1
:
Substrate
Name:
BDBM28582
Synonyms:
1-(4-iodo-2,5-dimethoxyphenyl)propan-2-amine DOI DOI,(-) [125I]4-iodo-2,5-dimethoxyphenylisopropylamine | [125I]DOI
Type:
radiolabeled ligand
Emp. Form.:
C11H16INO2
Mol. Mass.:
321.1547
SMILES:
COc1cc(CC(C)N)c(OC)cc1I
: