Target
High affinity nerve growth factor receptor
Ligand
BDBM136592
Substrate
Meas. Tech.
Omnia Assay
IC50
821±n/a nM
Citation
 Haas, JAndrews, SWJiang, YZhang, G Method of treatment using substituted pyrazolo[1,5-a] pyrimidine compounds US Patent  US10005783 Publication Date 6/26/2018 
Target
Name:
High affinity nerve growth factor receptor
Synonyms:
2.7.10.1 NTRK1 NTRK1_HUMAN Neurotrophic tyrosine kinase receptor type 1 Synonyms=MTC TRK1-transforming tyrosine kinase protein TRKA GN Trk-A Tropomyosin-related kinase A Tyrosine kinase receptor Tyrosine kinase receptor A Tyrosine kinase receptor A (Trk-A) gp140trk | p140-TrkA
Type:
Mol. Mass.:
87498.18
Organism:
Homo sapiens (Human)
Description:
P04629
Residue:
796
  
Inhibitor
Name:
BDBM136592
Synonyms:
US10005783, 9 US10774085, Example 9 US8865698, 9 | US9676783, 9
Type:
Small organic molecule
Emp. Form.:
C21H23FN6O2
Mol. Mass.:
410.4447
SMILES:
Fc1cccc(c1)[C@H]1CCCN1c1ccn2ncc(NC(=O)N3CCOCC3)c2n1
: