Target
High affinity nerve growth factor receptor
Ligand
BDBM136595
Substrate
Meas. Tech.
Omnia Assay
IC50
26.5±n/a nM
Citation
 Haas, JAndrews, SWJiang, YZhang, G Method of treatment using substituted pyrazolo[1,5-a] pyrimidine compounds US Patent  US10005783 Publication Date 6/26/2018 
Target
Name:
High affinity nerve growth factor receptor
Synonyms:
2.7.10.1 NTRK1 NTRK1_HUMAN Neurotrophic tyrosine kinase receptor type 1 Synonyms=MTC TRK1-transforming tyrosine kinase protein TRKA GN Trk-A Tropomyosin-related kinase A Tyrosine kinase receptor Tyrosine kinase receptor A Tyrosine kinase receptor A (Trk-A) gp140trk | p140-TrkA
Type:
Mol. Mass.:
87498.18
Organism:
Homo sapiens (Human)
Description:
P04629
Residue:
796
  
Inhibitor
Name:
BDBM136595
Synonyms:
US10005783, 12 US10774085, Example 12 US8865698, 12 | US9676783, 12
Type:
Small organic molecule
Emp. Form.:
C21H21F3N6O2
Mol. Mass.:
446.4256
SMILES:
OC1CN(C1)C(=O)Nc1cnn2ccc(nc12)N1CCC[C@@H]1c1cc(F)ccc1C(F)F
: