Target
High affinity nerve growth factor receptor
Ligand
BDBM136631
Substrate
Meas. Tech.
Omnia Assay
IC50
15.3±n/a nM
Citation
 Haas, JAndrews, SWJiang, YZhang, G Method of treatment using substituted pyrazolo[1,5-a] pyrimidine compounds US Patent  US10005783 Publication Date 6/26/2018 
Target
Name:
High affinity nerve growth factor receptor
Synonyms:
2.7.10.1 NTRK1 NTRK1_HUMAN Neurotrophic tyrosine kinase receptor type 1 Synonyms=MTC TRK1-transforming tyrosine kinase protein TRKA GN Tropomyosin alpha-3 chain/High affinity nerve growth factor receptor Tropomyosin-related kinase A (TrkA) Tyrosine kinase receptor (Trk) Tyrosine kinase receptor A (Trk A) Tyrosine kinase receptor A (TrkA) p140-TrkA
Type:
Mol. Mass.:
87498.18
Organism:
Homo sapiens (Human)
Description:
P04629
Residue:
796
  
Inhibitor
Name:
BDBM136631
Synonyms:
US10005783, 48 US10774085, Example 48 US8865698, 48 | US9676783, 48
Type:
Small organic molecule
Emp. Form.:
C28H34ClFN6O3
Mol. Mass.:
557.059
SMILES:
CC(C)(C)OC(=O)N1CCC(C)(CC1)C(=O)Nc1cnn2ccc(nc12)N1CCC[C@@H]1c1cc(F)ccc1Cl
: