Target
High affinity nerve growth factor receptor
Ligand
BDBM136634
Substrate
Meas. Tech.
Omnia Assay
IC50
5.20±n/a nM
Citation
 Haas, JAndrews, SWJiang, YZhang, G Method of treatment using substituted pyrazolo[1,5-a] pyrimidine compounds US Patent  US10005783 Publication Date 6/26/2018 
Target
Name:
High affinity nerve growth factor receptor
Synonyms:
2.7.10.1 NTRK1 NTRK1_HUMAN Neurotrophic tyrosine kinase receptor type 1 Synonyms=MTC TRK1-transforming tyrosine kinase protein TRKA GN Tropomyosin alpha-3 chain/High affinity nerve growth factor receptor Tropomyosin-related kinase A (TrkA) Tyrosine kinase receptor (Trk) Tyrosine kinase receptor A (Trk A) Tyrosine kinase receptor A (TrkA) p140-TrkA
Type:
Mol. Mass.:
87498.18
Organism:
Homo sapiens (Human)
Description:
P04629
Residue:
796
  
Inhibitor
Name:
BDBM136634
Synonyms:
US10005783, 51 US10774085, Example 51 US8865698, 51 | US9676783, 51
Type:
Small organic molecule
Emp. Form.:
C21H18F5N5O
Mol. Mass.:
451.3925
SMILES:
Fc1ccc(F)c(c1)[C@H]1CCCN1c1ccn2ncc(NC(=O)C3(CC3)C(F)(F)F)c2n1
: