Target
High affinity nerve growth factor receptor
Ligand
BDBM136655
Substrate
Meas. Tech.
Omnia Assay
IC50
45.5±n/a nM
Citation
 Haas, JAndrews, SWJiang, YZhang, G Method of treatment using substituted pyrazolo[1,5-a] pyrimidine compounds US Patent  US10005783 Publication Date 6/26/2018 
Target
Name:
High affinity nerve growth factor receptor
Synonyms:
2.7.10.1 NTRK1 NTRK1_HUMAN Neurotrophic tyrosine kinase receptor type 1 Synonyms=MTC TRK1-transforming tyrosine kinase protein TRKA GN Tropomyosin alpha-3 chain/High affinity nerve growth factor receptor Tropomyosin-related kinase A (TrkA) Tyrosine kinase receptor (Trk) Tyrosine kinase receptor A (Trk A) Tyrosine kinase receptor A (TrkA) p140-TrkA
Type:
Mol. Mass.:
87498.18
Organism:
Homo sapiens (Human)
Description:
P04629
Residue:
796
  
Inhibitor
Name:
BDBM136655
Synonyms:
US10005783, 72 US10774085, Example 72 US8865698, 72 | US9676783, 72
Type:
Small organic molecule
Emp. Form.:
C25H25FN6O3S
Mol. Mass.:
508.568
SMILES:
CCS(=O)(=O)Nc1ccc(cc1)C(=O)Nc1cnn2ccc(nc12)N1CCC[C@@H]1c1cccc(F)c1
: