Target
High affinity nerve growth factor receptor
Ligand
BDBM136674
Substrate
Meas. Tech.
Omnia Assay
IC50
10.2±n/a nM
Citation
 Haas, JAndrews, SWJiang, YZhang, G Method of treatment using substituted pyrazolo[1,5-a] pyrimidine compounds US Patent  US10005783 Publication Date 6/26/2018 
Target
Name:
High affinity nerve growth factor receptor
Synonyms:
2.7.10.1 NTRK1 NTRK1_HUMAN Neurotrophic tyrosine kinase receptor type 1 Synonyms=MTC TRK1-transforming tyrosine kinase protein TRKA GN Trk-A Tropomyosin-related kinase A Tyrosine kinase receptor Tyrosine kinase receptor A Tyrosine kinase receptor A (Trk-A) gp140trk | p140-TrkA
Type:
Mol. Mass.:
87498.18
Organism:
Homo sapiens (Human)
Description:
P04629
Residue:
796
  
Inhibitor
Name:
BDBM136674
Synonyms:
US10005783, 91 US11267818, Example 91 US9676783, 91
Type:
Small organic molecule
Emp. Form.:
C23H27FN6O3
Mol. Mass.:
454.4973
SMILES:
COc1ccc(F)cc1[C@H]1CCCN1c1ccn2ncc(NC(=O)N3CCC[C@H](O)C3)c2n1
: