Target
Tyrosine-protein kinase receptor UFO
Ligand
BDBM246883
Substrate
Meas. Tech.
TAM Enzymatic Assay
IC50
<100±n/a nM
Citation
 Li, YBurns, DM Bicyclic fused pyrimidine compounds as TAM inhibitors US Patent  US10005788 Publication Date 6/26/2018 
Target
Name:
Tyrosine-protein kinase receptor UFO
Synonyms:
AXL TEL/AXL UFO | UFO_HUMAN
Type:
Enzyme
Mol. Mass.:
98316.97
Organism:
Homo sapiens (Human)
Description:
P30530
Residue:
894
  
Inhibitor
Name:
BDBM246883
Synonyms:
US10005788, 1 (2nd peak, cis-) US10065963, Compound 22 US10336759, # 22 US10519163, Example 22 US11084822, Example 22 US11136326, Example 22 US11324749, Comp. No. 22 US11596632, Comp. No. 22 US9732097, Example 22 | {1-(cis-4-{[4-{[(3S)- 3-hydroxypyrrolidin- 1-yl]methyl}-6- (trifluoromethyl) pyridin-2- yl]oxy}cyclohexyl)- 3-[4-(7H-pyrrolo[2,3- d]pyrimidin-4-yl)- 1H-pyrazol-1- yl]azetidin-3- yl jacetonitrile
Type:
Small organic molecule
Emp. Form.:
C31H34F3N9O2
Mol. Mass.:
621.656
SMILES:
O[C@H]1CCN(Cc2cc(O[C@H]3CC[C@H](CC3)N3CC(CC#N)(C3)n3cc(cn3)-c3ncnc4[nH]ccc34)nc(c2)C(F)(F)F)C1
: