Target
Tyrosine-protein kinase Mer
Ligand
BDBM401630
Substrate
Meas. Tech.
TAM Enzymatic Assay
IC50
<100±n/a nM
Citation
 Li, YBurns, DM Bicyclic fused pyrimidine compounds as TAM inhibitors US Patent  US10005788 Publication Date 6/26/2018 
Target
Name:
Tyrosine-protein kinase Mer
Synonyms:
MER MERTK Proto-oncogene c-Mer Receptor tyrosine kinase MerTK | Tyrosine-protein kinase Mer
Type:
PROTEIN
Mol. Mass.:
110234.77
Organism:
Homo sapiens (Human)
Description:
ChEMBL_1498723
Residue:
999
  
Inhibitor
Name:
BDBM401630
Synonyms:
US10005788, 8 (1st peak)
Type:
Small organic molecule
Emp. Form.:
C22H29N5O2
Mol. Mass.:
395.498
SMILES:
CCCCNc1ncc2c(nc([C@H]3CC[C@H](O)CC3)n2n1)-c1cccc(CO)c1
: