Target
Dimer of Gag-Pol polyprotein [489-587]
Ligand
BDBM819
Substrate
Biotinylated HIV-1 Protease Peptide Substrate
Meas. Tech.
Protease Inhibition Assay
pH
5.5±n/a
Temperature
295.15±n/a K
IC50
0.22±n/a nM
Citation
 Munroe, JEShepherd, TAJungheim, LNHornback, WJHatch, SDMuesing, MAWiskerchen, MSu, KSCampanale, KMBaxter, AJColacino, JM Potent, orally bioavailable HIV-1 protease inhibitors containing noncoded D-amino acids Bioorg Med Chem Lett 5:2897-902 (1995)   
Target
Name:
Dimer of Gag-Pol polyprotein [489-587]
Synonyms:
HIV-1 Protease
Type:
Protein Complex
Mol. Mass.:
Description:
Components:
This complex has 2 components.
Component 1
Name:
Gag-Pol polyprotein [489-587]
Synonyms:
HIV protease HIV-1 Protease chain A POL_HV1N5 | gag-pol
Type:
Enzyme Subunit
Mol. Mass.:
10822.21
Organism:
Human immunodeficiency virus type 1
Description:
P12497[489-587]
Residue:
99
  
Component 2
Name:
Gag-Pol polyprotein [489-587]
Synonyms:
HIV protease HIV-1 Protease chain A POL_HV1N5 | gag-pol
Type:
Enzyme Subunit
Mol. Mass.:
10822.21
Organism:
Human immunodeficiency virus type 1
Description:
P12497[489-587]
Residue:
99
  
Inhibitor
Name:
BDBM819
Synonyms:
(3aR,6S,7aS)-N-tert-butyl-5-[(2R,3S)-3-[(2S)-3-[(4-fluorobenzene)sulfonyl]-2-methanesulfonamidopropanamido]-2-hydroxy-4-phenylbutyl]-octahydrothieno[3,2-c]pyridine-6-carboxamide | Saquinavir/Nelfinavir deriv. 23
Type:
Small organic molecule
Emp. Form.:
C32H45FN4O7S3
Mol. Mass.:
712.916
SMILES:
[H][C@]12CCS[C@@]1([H])C[C@H](N(C[C@@H](O)[C@H](Cc1ccccc1)NC(=O)[C@@H](CS(=O)(=O)c1ccc(F)cc1)NS(C)(=O)=O)C2)C(=O)NC(C)(C)C
:
Substrate
Name:
Biotinylated HIV-1 Protease Peptide Substrate
Synonyms:
Type:
Peptide
Mol. Mass.:
2106.93
Organism:
Description:
Residue:
19
ITINGSQNYPIVGKFITCH