Target
Protein arginine N-methyltransferase 5
Ligand
BDBM401719
Substrate
Meas. Tech.
iochemical Assay
IC50
1366±n/a nM
Citation
 Bergman, YELessene, RGaname, DFoitzik, RCMorrow, BJCamerino, MAWalker, SRLagiakos, HRFeutrill, JStupple, PA Aminoindane-, aminotetrahydronaphthalene- and aminobenzocyclobutane-derived PRMT5-inhibitors US Patent  US10005792 Publication Date 6/26/2018 
Target
Name:
Protein arginine N-methyltransferase 5
Synonyms:
72 kDa ICln-binding protein HRMT1L5 IBP72 Jak-binding protein 1 PRMT5/MEP50 complex Protein arginine methyltransferase 5 (PRMT5) SKB1 homolog Shk1 kinase-binding protein 1 homolog
Type:
Enzyme
Mol. Mass.:
72679.99
Organism:
Homo sapiens (Human)
Description:
O14744
Residue:
637
  
Inhibitor
Name:
BDBM401719
Synonyms:
US10005792, Compound 81
Type:
Small organic molecule
Emp. Form.:
C25H31N3O4
Mol. Mass.:
437.5313
SMILES:
COC1CCN(C1)C(=O)c1ccc(cc1)C(=O)NC[C@@H](O)CNC1Cc2ccccc2C1
: