Target
Dual specificity protein phosphatase 1
Ligand
BDBM35424
Substrate
OMFP Substrate
Meas. Tech.
In vitro MKP-1 Phosphatase HTS Dose Response Confirmation Assay
pH
7±n/a
Temperature
295.15±n/a K
IC50
>50000±n/a nM
Citation
 PubChem, PC In vitro MKP-1 Phosphatase HTS Dose Response Confirmation Assay PubChem Bioassay (2007)[AID] 
Target
Name:
Dual specificity protein phosphatase 1
Synonyms:
CL100 DUSP1 MAP kinase phosphatase 1 MKP1 Protein-tyrosine phosphatase CL100 | VH1
Type:
Protein phosphatase
Mol. Mass.:
39301.48
Organism:
Homo sapiens (Human)
Description:
gi_4758204
Residue:
367
  
Inhibitor
Name:
BDBM35424
Synonyms:
2-(4-methylanilino)-6-[(1-phenyltetrazol-5-yl)sulfanylmethyl]-1H-pyrimidin-4-one 2-[(4-methylphenyl)amino]-6-[(1-phenyl-1,2,3,4-tetrazol-5-yl)sulfanylmethyl]-1H-pyrimidin-4-one 6-[[(1-phenyltetrazol-5-yl)thio]methyl]-2-(p-toluidino)-1H-pyrimidin-4-one SMR000076092 | cid_1214377
Type:
Small organic molecule
Emp. Form.:
C19H17N7OS
Mol. Mass.:
391.45
SMILES:
Cc1ccc(Nc2nc(CSc3nnnn3-c3ccccc3)cc(=O)[nH]2)cc1
:
Substrate
Name:
OMFP Substrate
Synonyms:
3-O-methylfluorescein phosphate | OMFP
Type:
fluorescent substrate
Mol. Mass.:
358.43
Organism:
Description:
Residue:
3
NA