Target
Dual specificity protein phosphatase 1
Ligand
BDBM33114
Substrate
OMFP Substrate
Meas. Tech.
In vitro MKP-1 Phosphatase Dose Response SAR Support Assay
pH
7±n/a
Temperature
296.15±n/a K
IC50
13370±n/a nM
Citation
 PubChem, PC In vitro MKP-1 Phosphatase Dose Response SAR Support Assay  PubChem Bioassay (2007)[AID] 
Target
Name:
Dual specificity protein phosphatase 1
Synonyms:
CL100 DUSP1 MAP kinase phosphatase 1 MKP1 Protein-tyrosine phosphatase CL100 | VH1
Type:
Protein phosphatase
Mol. Mass.:
39301.48
Organism:
Homo sapiens (Human)
Description:
gi_4758204
Residue:
367
  
Inhibitor
Name:
BDBM33114
Synonyms:
2-(2-furanyl)-4-quinolinecarboxylic acid [2-[4-amino-1-methyl-2,6-dioxo-3-(phenylmethyl)-5-pyrimidinyl]-2-oxoethyl] ester MLS000889032 [2-(6-amino-1-benzyl-3-methyl-2,4-dioxopyrimidin-5-yl)-2-oxoethyl] 2-(furan-2-yl)quinoline-4-carboxylate cid_9547731
Type:
Small organic molecule
Emp. Form.:
C28H22N4O6
Mol. Mass.:
510.4975
SMILES:
Cn1c(=O)c(C(=O)COC(=O)c2cc(nc3ccccc23)-c2ccco2)c(N)n(Cc2ccccc2)c1=O
:
Substrate
Name:
OMFP Substrate
Synonyms:
3-O-methylfluorescein phosphate | OMFP
Type:
fluorescent substrate
Mol. Mass.:
358.43
Organism:
Description:
Residue:
3
NA