Target
Orexin/Hypocretin receptor type 1
Ligand
BDBM401808
Substrate
Meas. Tech.
FLIPR Ca2+ Flux Assay
IC50
7.50±n/a nM
Citation
 Liverton, NKuduk, SDBeshore, DLuo, YMeng, N Pyrazole, triazole and tetrazole orexin receptor antagonists US Patent  US10010539 Publication Date 7/3/2018 
Target
Name:
Orexin/Hypocretin receptor type 1
Synonyms:
Hcrtr1 OX1R_RAT Orexin receptor type 1 (OX1R) Ox1-R | Ox1R
Type:
Protein
Mol. Mass.:
46817.55
Organism:
Rattus norvegicus (Rat)
Description:
P56718
Residue:
416
  
Inhibitor
Name:
BDBM401808
Synonyms:
(2-(2H-1,2,3-triazol-2-yl)phenyl)((2R,5R)-5-(4-(2-hydroxypropan-2-yl)-2H-1,2,3-triazol-2-yl)-2-methylpiperidin-1-yl)methanone | US10010539, 25
Type:
Small organic molecule
Emp. Form.:
C20H25N7O2
Mol. Mass.:
395.4582
SMILES:
C[C@@H]1CC[C@H](CN1C(=O)c1ccccc1-n1nccn1)n1ncc(n1)C(C)(C)O
: