Target
Serine/threonine-protein kinase Chk1
Ligand
BDBM402012
Substrate
Meas. Tech.
Kinase Inhibiting Activity Assay
IC50
0.140±n/a nM
Citation
 Boyle, RGWalker, DWBoyce, RJPeterson, SFarouz, FVo, CH Pharmaceutical compounds US Patent  US10010547 Publication Date 7/3/2018 
Target
Name:
Serine/threonine-protein kinase Chk1
Synonyms:
CHEK1 CHK1 checkpoint homolog Checkpoint kinase-1 (CHK1)
Type:
Enzyme Catalytic Domain
Mol. Mass.:
54443.02
Organism:
Homo sapiens (Human)
Description:
gi_166295192
Residue:
476
  
Inhibitor
Name:
BDBM402012
Synonyms:
5-[[5-[2,6-dimethoxy-4-(4-methylpiperazin-1-yl)phenyl]-1H-pyrazol-3-yl]amino]pyrazine-2-carbonitrile hydrochloride US10973817, Example 122
Type:
Small organic molecule
Emp. Form.:
C21H24N8O2
Mol. Mass.:
420.4677
SMILES:
COc1cc(cc(OC)c1-c1cc(Nc2cnc(cn2)C#N)n[nH]1)N1CCN(C)CC1
: