Target
Phosphatidylinositol 3-kinase regulatory subunit alpha/4,5-bisphosphate 3-kinase catalytic subunit alpha isoform
Ligand
BDBM35585
Substrate
BDBM15235
Meas. Tech.
mTOR Kinase Assay
Temperature
298.15±n/a K
IC50
100±n/a nM
Comments
extracted
Citation
 Zask, AVerheijen, JCCurran, KKaplan, JRichard, DJNowak, PMalwitz, DJBrooijmans, NBard, JSvenson, KLucas, JToral-Barza, LZhang, WGHollander, IGibbons, JJAbraham, RTAyral-Kaloustian, SMansour, TSYu, K ATP-Competitive Inhibitors of the Mammalian Target of Rapamycin: Design and Synthesis of Highly Potent and Selective Pyrazolopyrimidines J Med Chem 52:5013-6 (2009)  
Target
Name:
Phosphatidylinositol 3-kinase regulatory subunit alpha/4,5-bisphosphate 3-kinase catalytic subunit alpha isoform
Synonyms:
PI3 Kinase alpha (p110 alpha/p85 alpha) PI3-kinase p110-alpha/p85-alpha subunit PI3K (p110alpha/p85alpha) PI3Kalpha Complex (Full Length p110alpha and p85alpha) Phosphoinositide 3-Kinase (PI3K) Chain B/ alpha Chain A Phosphoinositide 3-kinase alpha p110a / p85a p110alpha/p85alpha
Type:
Protein
Mol. Mass.:
Description:
Components:
This complex has 2 components.
Component 1
Name:
Phosphatidylinositol 4,5-bisphosphate 3-kinase catalytic subunit alpha isoform
Synonyms:
P42336 PI3-kinase subunit p110-alpha PIK3CA Phosphatidylinositol 3-kinase alpha (PI3Kalpha) Phosphatidylinositol 4,5-bisphosphate 3-kinase (PI3K) Phosphatidylinositol 4,5-bisphosphate 3-kinase catalytic subunit alpha (PI3Kalpha) Phosphatidylinositol 4,5-bisphosphate 3-kinase catalytic subunit alpha isoform (PI3-Ka) Phosphatidylinositol 4,5-bisphosphate 3-kinase catalytic subunit alpha isoform (PI3K p110alpha) Phosphatidylinositol 4,5-bisphosphate 3-kinase catalytic subunit alpha isoform (PI3K-alpha) Phosphatidylinositol 4,5-bisphosphate 3-kinase catalytic subunit alpha isoform (PI3Kalpha p110alpha) Phosphatidylinositol 4,5-bisphosphate 3-kinase catalytic subunit alpha isoform (PIK3CA) Phosphatidylinositol-4,5-bisphosphate 3-kinase catalytic subunit alpha isoform Phosphoinositide 3-Kinase (PI3K), alpha Chain A Phosphoinositide 3-kinases (PI3K) PtdIns-3-kinase p110 | p110 alpha
Type:
Enzyme Subunit
Mol. Mass.:
124294.87
Organism:
Homo sapiens (Human)
Description:
P42336
Residue:
1068
  
Component 2
Name:
Phosphatidylinositol 3-kinase regulatory subunit alpha
Synonyms:
GRB1 PI3-kinase class I PI3-kinase p85-alpha subunit PI3-kinase subunit p85-alpha PIK3CG/PIK3R1 Phosphatidylinositol 3-kinase 85 kDa regulatory subunit alpha (PI3K alpha) Phosphatidylinositol 3-kinase regulatory subunit alpha (PIK3R1) Phosphatidylinositol 3-kinase regulatory subunit alpha isoform 1 (PI3 Kinase alpha) Phosphatidylinositol 4,5-bisphosphate 3-kinase catalytic subunit alpha isoform (PI3Kalpha) PtdIns-3-kinase p85-alpha p85 alpha
Type:
Protein
Mol. Mass.:
83592.82
Organism:
Homo sapiens (Human)
Description:
P27986
Residue:
724
  
Inhibitor
Name:
BDBM35585
Synonyms:
pyrazolo pyrimidine, 18
Type:
Small organic molecule
Emp. Form.:
C24H30N8O4
Mol. Mass.:
494.5462
SMILES:
CNC(=O)Nc1ccc(cc1)-c1nc(N2CCOCC2)c2cnn(C3CCN(CC3)C(=O)OC)c2n1
:
Substrate
Name:
BDBM15235
Synonyms:
L-alpha-Phosphatidylinositol 4,5-bisphosphate PtdInsP2
Type:
Small organic molecule
Emp. Form.:
C47H80O19P3
Mol. Mass.:
1042.0507
SMILES:
CCCCCCCCCCCCCCCCCC(=O)OCC(COP([O-])(=O)O[C@@H]1[C@H](O)[C@H](O)[C@@H](OP([O-])([O-])=O)[C@H](OP([O-])([O-])=O)[C@H]1O)OC(=O)CCC\C=C/C\C=C/C\C=C/C\C=C/CCCCC
: