Target
Tyrosine-protein kinase JAK2
Ligand
BDBM402041
Substrate
Meas. Tech.
Kinase Profile Screening Assay
IC50
>10000±n/a nM
Citation
 Lu, XYu, JYang, QLi, ZPan, DShan, SZhu, JWang, XLiu, XNing, Z Preparation method for aromatic heterocyclic compound used as selective JAK3 and/or JAK1 kinase inhibitor and application of aromatic heterocyclic compound US Patent  US10011571 Publication Date 7/3/2018 
Target
Name:
Tyrosine-protein kinase JAK2
Synonyms:
JAK-2 JAK2_HUMAN Janus kinase 2 (JAK2) | Janus kinase 2 (a protein tyrosine kinase)
Type:
Protein
Mol. Mass.:
130684.68
Organism:
Homo sapiens (Human)
Description:
O60674
Residue:
1132
  
Inhibitor
Name:
BDBM402041
Synonyms:
Preparation of N-(3-(5-chloro-2-(4-fluoro-3-(N-methylacrylamido)phenylamino)pyrimidinyl-4-amino)propyl)-4-trifluoromethylbenzamide | US10011571, Example 22
Type:
Small organic molecule
Emp. Form.:
C25H23ClF4N6O2
Mol. Mass.:
550.936
SMILES:
CN(C(=O)C=C)c1cc(Nc2ncc(Cl)c(NCCCNC(=O)c3ccc(cc3)C(F)(F)F)n2)ccc1F
: