Target
Glycogen phosphorylase, liver form
Ligand
BDBM35626
Substrate
BDBM24362
Meas. Tech.
Glycogen Phosphorylase Activity Assay
pH
6.8±n/a
Temperature
295.15±n/a K
IC50
2600±n/a nM
Citation
 Onda, KSuzuki, TShiraki, RYonetoku, YNegoro, KMomose, KKatayama, NOrita, MYamaguchi, TOhta, MTsukamoto, S Synthesis of 5-chloro-N-aryl-1H-indole-2-carboxamide derivatives as inhibitors of human liver glycogen phosphorylase a. Bioorg Med Chem 16:5452-64 (2008)  
Target
Name:
Glycogen phosphorylase, liver form
Synonyms:
Glycogen Phosphorylase (PYGL) Liver glycogen phosphorylase PYGL_HUMAN
Type:
Homodimer
Mol. Mass.:
97153.98
Organism:
Homo sapiens (Human)
Description:
Dimers associate into a tetramer to form the enzymatically active phosphorylase A.
Residue:
847
  
Inhibitor
Name:
BDBM35626
Synonyms:
5-chloroindolecarboxamide, 9a
Type:
Small organic molecule
Emp. Form.:
C18H17ClN2O3
Mol. Mass.:
344.792
SMILES:
Cc1cc(ccc1NC(=O)c1cc2cc(Cl)ccc2[nH]1)C(O)CO
:
Substrate
Name:
BDBM24362
Synonyms:
(glucose)n | glycogen
Type:
polymer of glucose
Emp. Form.:
Mol. Mass.:
SMILES:
: