Target
Glycogen phosphorylase, liver form
Ligand
BDBM35627
Substrate
BDBM24362
Meas. Tech.
Glycogen Phosphorylase Activity Assay
pH
6.8±n/a
Temperature
295.15±n/a K
IC50
3200±n/a nM
Citation
 Onda, KSuzuki, TShiraki, RYonetoku, YNegoro, KMomose, KKatayama, NOrita, MYamaguchi, TOhta, MTsukamoto, S Synthesis of 5-chloro-N-aryl-1H-indole-2-carboxamide derivatives as inhibitors of human liver glycogen phosphorylase a. Bioorg Med Chem 16:5452-64 (2008)  
Target
Name:
Glycogen phosphorylase, liver form
Synonyms:
Glycogen Phosphorylase (PYGL) Liver glycogen phosphorylase PYGL_HUMAN
Type:
Homodimer
Mol. Mass.:
97153.98
Organism:
Homo sapiens (Human)
Description:
Dimers associate into a tetramer to form the enzymatically active phosphorylase A.
Residue:
847
  
Inhibitor
Name:
BDBM35627
Synonyms:
5-chloroindolecarboxamide, 9b
Type:
Small organic molecule
Emp. Form.:
C17H14ClFN2O3
Mol. Mass.:
348.756
SMILES:
OCC(O)c1ccc(NC(=O)c2cc3cc(Cl)ccc3[nH]2)c(F)c1
:
Substrate
Name:
BDBM24362
Synonyms:
(glucose)n | glycogen
Type:
polymer of glucose
Emp. Form.:
Mol. Mass.:
SMILES:
: