Target
Orexin/Hypocretin receptor type 1
Ligand
BDBM185304
Substrate
Meas. Tech.
FLIPR Assay
IC50
18.0±n/a nM
Citation
 Fieldhouse, CGlen, AMaine, SFujimoto, TRobinson, JS 1,2-substituted cyclopentanes as orexin receptor antagonists US Patent  US10011588 Publication Date 7/3/2018 
Target
Name:
Orexin/Hypocretin receptor type 1
Synonyms:
HCRTR1 OX1R_HUMAN Orexin receptor type 1 (OR 1) Orexin receptor type 1 (OX1) Orexin receptor type 1 (OxR1) | Ox1r
Type:
Protein
Mol. Mass.:
47554.50
Organism:
Homo sapiens (Human)
Description:
O43613
Residue:
425
  
Inhibitor
Name:
BDBM185304
Synonyms:
US10011588, Example 123 US9156829, 123
Type:
Small organic molecule
Emp. Form.:
C19H17F4N7O
Mol. Mass.:
435.3782
SMILES:
Fc1cc(cnc1N[C@H]1CCC[C@@H]1NC(=O)c1ncccc1-n1nccn1)C(F)(F)F
: