Target
Orexin receptor type 2
Ligand
BDBM402058
Substrate
Meas. Tech.
FLIPR Ca2+ Flux Assay
IC50
19.9±n/a nM
Citation
 Kim, RMKuduk, SDLiverton, NZhou, G Ethyldiamine orexin receptor antagonists US Patent  US10011595 Publication Date 7/3/2018 
Target
Name:
Orexin receptor type 2
Synonyms:
HCRTR2 OX2R_HUMAN Orexin receptor type 2 (OR-2) Orexin receptor type 2 (OX2R) Ox-2-R | Ox2-R
Type:
Protein
Mol. Mass.:
50710.53
Organism:
Homo sapiens (Human)
Description:
O43614
Residue:
444
  
Inhibitor
Name:
BDBM402058
Synonyms:
N-{2-[(4,6-dimethylpyrimidin-2- yl)(methyl)amino]ethyl}-N-ethyl-2- propylbenzamide | US10011595, B-16
Type:
Small organic molecule
Emp. Form.:
C21H30N4O
Mol. Mass.:
354.4891
SMILES:
CCCc1ccccc1C(=O)N(CC)CCN(C)c1nc(C)cc(C)n1
: