Target
Orexin receptor type 2
Ligand
BDBM402118
Substrate
Meas. Tech.
FLIPR Ca2+ Flux Assay
IC50
19.8±n/a nM
Citation
 Kim, RMKuduk, SDLiverton, NZhou, G Ethyldiamine orexin receptor antagonists US Patent  US10011595 Publication Date 7/3/2018 
Target
Name:
Orexin receptor type 2
Synonyms:
HCRTR2 OX2R_HUMAN Orexin receptor type 2 (OR-2) Orexin receptor type 2 (OX2R) Ox-2-R | Ox2-R
Type:
Protein
Mol. Mass.:
50710.53
Organism:
Homo sapiens (Human)
Description:
O43614
Residue:
444
  
Inhibitor
Name:
BDBM402118
Synonyms:
US10011595, G-5
Type:
Small organic molecule
Emp. Form.:
C22H25N7O
Mol. Mass.:
403.4802
SMILES:
CCCCN(CCN(C)c1cc(ccn1)C#N)C(=O)c1ccccc1-n1nccn1
: