Target
Dimer of Gag-Pol polyprotein [501-599]
Ligand
BDBM848
Substrate
Fluorogenic Peptide Substrate
Meas. Tech.
Protease Inhibition Assay
pH
5±n/a
Temperature
303.15±n/a K
Ki
1.2±n/a nM
Citation
 Alterman, MAndersson, HOGarg, NAhlsen, GLovgren, SClasson, BDanielson, UHKvarnstrom, IVrang, LUnge, TSamuelsson, BHallberg, A Design and fast synthesis of C-terminal duplicated potent C(2)-symmetric P1/P1'-modified HIV-1 protease inhibitors. J Med Chem 42:3835-44 (1999)  
Target
Name:
Dimer of Gag-Pol polyprotein [501-599]
Synonyms:
HIV-1 Protease | HIV-1 Protease, recombinant, isolate HXB2
Type:
Protein Complex
Mol. Mass.:
Description:
Components:
This complex has 2 components.
Component 1
Name:
Gag-Pol polyprotein [501-599]
Synonyms:
BRU isolated HIV-1 Protease B Subtype Chain B LAI(Wild type) Protease Retropepsin | gag-pol
Type:
Enzyme Subunit
Mol. Mass.:
10795.19
Organism:
Human immunodeficiency virus type 1
Description:
P03367[501-599]
Residue:
99
  
Component 2
Name:
Gag-Pol polyprotein [501-599]
Synonyms:
BRU isolated HIV-1 Protease B Subtype Chain B LAI(Wild type) Protease Retropepsin | gag-pol
Type:
Enzyme Subunit
Mol. Mass.:
10795.19
Organism:
Human immunodeficiency virus type 1
Description:
P03367[501-599]
Residue:
99
  
Inhibitor
Name:
BDBM848
Synonyms:
(2R,3R,4R,5R)-3,4-dihydroxy-N,N'-bis[(1S)-2-methyl-1-(methylcarbamoyl)propyl]-2,5-bis({[4-(thiophen-3-yl)phenyl]methoxy})hexanediamide CHEMBL127214 symmetric/asymmetric inhibitor 7
Type:
Small organic molecule
Emp. Form.:
C40H50N4O8S2
Mol. Mass.:
778.977
SMILES:
CNC(=O)[C@@H](NC(=O)[C@H](OCc1ccc(cc1)-c1ccsc1)[C@H](O)[C@@H](O)[C@@H](OCc1ccc(cc1)-c1ccsc1)C(=O)N[C@@H](C(C)C)C(=O)NC)C(C)C
:
Substrate
Name:
Fluorogenic Peptide Substrate
Synonyms:
Type:
Peptide
Mol. Mass.:
4156.59
Organism:
Description:
Residue:
39