Target
Dual specificity mitogen-activated protein kinase kinase 1
Ligand
BDBM200372
Substrate
Meas. Tech.
TR-FRET Assay
IC50
5.00±n/a nM
Citation
 Bock, MGMoebitz, HPanigrahi, SKPoddutoori, RSamajdar, S Compounds and compositions as inhibitors of MEK US Patent  US10011599 Publication Date 7/3/2018 
Target
Name:
Dual specificity mitogen-activated protein kinase kinase 1
Synonyms:
Dual specificity mitogen-activated protein kinase (MEK) Dual specificity mitogen-activated protein kinase kinase 1 (MEK1) Dual specificity mitogen-activated protein kinase kinase MEK1/2 MAP kinase kinase 1 MAPK/ERK kinase 1 MEK-1 MP2K1_HUMAN PRKMK1 | VHL-MAP2K1/MAP2K2
Type:
Other Protein Type
Mol. Mass.:
43439.03
Organism:
Homo sapiens (Human)
Description:
Full-length human MEK-1 was generated by PCR and purified as a fusion protein from Escherichia coli lysates.
Residue:
393
  
Inhibitor
Name:
BDBM200372
Synonyms:
US10011599, Example 1A US9629836, 1A
Type:
Small organic molecule
Emp. Form.:
C28H23ClF2N6O3
Mol. Mass.:
564.97
SMILES:
Cc1nc2cnc3cc(F)c(cc3c2n1[C@H]1CCN(C[C@@H]1F)C(=O)CO)-c1ccc(Oc2ncccn2)cc1Cl
: