Target
Dual specificity mitogen-activated protein kinase kinase 1
Ligand
BDBM200384
Substrate
Meas. Tech.
TR-FRET Assay
IC50
212±n/a nM
Citation
 Bock, MGMoebitz, HPanigrahi, SKPoddutoori, RSamajdar, S Compounds and compositions as inhibitors of MEK US Patent  US10011599 Publication Date 7/3/2018 
Target
Name:
Dual specificity mitogen-activated protein kinase kinase 1
Synonyms:
Dual specificity mitogen-activated protein kinase (MEK) Dual specificity mitogen-activated protein kinase kinase 1 (MEK1) Dual specificity mitogen-activated protein kinase kinase MEK1/2 MAP kinase kinase 1 MAPK/ERK kinase 1 MEK-1 MP2K1_HUMAN PRKMK1 | VHL-MAP2K1/MAP2K2
Type:
Other Protein Type
Mol. Mass.:
43439.03
Organism:
Homo sapiens (Human)
Description:
Full-length human MEK-1 was generated by PCR and purified as a fusion protein from Escherichia coli lysates.
Residue:
393
  
Inhibitor
Name:
BDBM200384
Synonyms:
US10011599, Example 12 US9629836, 12
Type:
Small organic molecule
Emp. Form.:
C28H24ClFN6O2
Mol. Mass.:
530.981
SMILES:
CC(=O)N1CCC(CC1)n1c(C)nc2cnc3cc(F)c(cc3c12)-c1ccc(Oc2ncccn2)cc1Cl
: