Target
High affinity nerve growth factor receptor
Ligand
BDBM200576
Substrate
Meas. Tech.
Omnia Kinase Assay
IC50
2.10±n/a nM
Citation
 Andrews, SWHaas, JJiang, YZhang, G Method of treatment using substituted imidazo[1,2b]pyridazine compounds US Patent  US10011604 Publication Date 7/3/2018 
Target
Name:
High affinity nerve growth factor receptor
Synonyms:
2.7.10.1 NTRK1 NTRK1_HUMAN Neurotrophic tyrosine kinase receptor type 1 Synonyms=MTC TRK1-transforming tyrosine kinase protein TRKA GN Tropomyosin alpha-3 chain/High affinity nerve growth factor receptor Tropomyosin-related kinase A (TrkA) Tyrosine kinase receptor (Trk) Tyrosine kinase receptor A (Trk A) Tyrosine kinase receptor A (TrkA) p140-TrkA
Type:
Mol. Mass.:
87498.18
Organism:
Homo sapiens (Human)
Description:
P04629
Residue:
796
  
Inhibitor
Name:
BDBM200576
Synonyms:
US10011604, 4 US9227975, 4 | US9795611, 4
Type:
Small organic molecule
Emp. Form.:
C24H22F2N6O3S
Mol. Mass.:
512.532
SMILES:
CS(=O)(=O)Nc1ccc(cc1)C(=O)Nc1cnc2ccc(nn12)N1CCC[C@@H]1c1cc(F)ccc1F
: