Target
Carbonic anhydrase 5B, mitochondrial
Ligand
BDBM35737
Substrate
BDBM10856
Meas. Tech.
CA Inhibition Assay
Temperature
298.15±n/a K
Ki
8.1±n/a nM
Comments
extracted
Citation
 Güzel, OInnocenti, AScozzafava, ASalman, ASupuran, CT Carbonic anhydrase inhibitors. Aromatic/heterocyclic sulfonamides incorporating phenacetyl, pyridylacetyl and thienylacetyl tails act as potent inhibitors of human mitochondrial isoforms VA and VB. Bioorg Med Chem 17:4894-9 (2009)  
Target
Name:
Carbonic anhydrase 5B, mitochondrial
Synonyms:
CA-VB CAH5B_HUMAN Carbonic Anhydrase VB Carbonic anhydrase 5B, mitochondrial Carbonic anhydrase V | Carbonic anhydrase VB (CA VB)
Type:
Enzyme
Mol. Mass.:
36440.83
Organism:
Homo sapiens (Human)
Description:
Human (cloned) isozyme
Residue:
317
  
Inhibitor
Name:
BDBM35737
Synonyms:
sulfonamide deriv., 7e
Type:
Small organic molecule
Emp. Form.:
C14H13ClN2O3S
Mol. Mass.:
324.783
SMILES:
NS(=O)(=O)c1ccc(NC(=O)Cc2ccccc2)c(Cl)c1
:
Substrate
Name:
BDBM10856
Synonyms:
Carbon Dioxide | methanedione
Type:
Small organic molecule
Emp. Form.:
CO2
Mol. Mass.:
44.0095
SMILES:
O=C=O
: