Target
Metabotropic glutamate receptor 4
Ligand
BDBM402173
Substrate
Meas. Tech.
Ca2+ Mobilization In Vitro Assay
EC50
73.0±n/a nM
Citation
 Jaeschke, GO Hara, FPlancher, JRicci, ARueher, DVieira, E Ethynyl derivatives US Patent  US10011607 Publication Date 7/3/2018 
Target
Name:
Metabotropic glutamate receptor 4
Synonyms:
GPRC1D GRM4_HUMAN MGLUR4 Metabotropic glutamate receptor 4 (mGlu4) metabotropic glutamate 4
Type:
Protein
Mol. Mass.:
101899.95
Organism:
Homo sapiens (Human)
Description:
Q14833
Residue:
912
  
Inhibitor
Name:
BDBM402173
Synonyms:
(9aS)-7-[2,6-difluoro-4-(2- phenylethynyl)phenyl]-9a- methyl-2-(3-pyridyl)-4,9- dihydro-3H-pyrazinol[1,2- c]pyrimidine-1,6,8-trione | US10011607, 7
Type:
Small organic molecule
Emp. Form.:
C27H20F2N4O3
Mol. Mass.:
486.4695
SMILES:
C[C@@]12CC(=O)N(C(=O)N1CCN(C2=O)c1cccnc1)c1c(F)cc(cc1F)C#Cc1ccccc1
: