Target
Metabotropic glutamate receptor 4
Ligand
BDBM402245
Substrate
Meas. Tech.
Ca2+ Mobilization In Vitro Assay
EC50
244±n/a nM
Citation
 Jaeschke, GO Hara, FPlancher, JRicci, ARueher, DVieira, E Ethynyl derivatives US Patent  US10011607 Publication Date 7/3/2018 
Target
Name:
Metabotropic glutamate receptor 4
Synonyms:
GPRC1D GRM4_HUMAN MGLUR4 Metabotropic glutamate receptor 4 (mGlu4) metabotropic glutamate 4
Type:
Protein
Mol. Mass.:
101899.95
Organism:
Homo sapiens (Human)
Description:
Q14833
Residue:
912
  
Inhibitor
Name:
BDBM402245
Synonyms:
(9aS)-7-[2,6-difluoro-4-(2- phenylethynyl)phenyl]-9a- methyl-2-(1-methyl-1,2,4- triazol-3-yl)-4,9-dihydro-3H- pyrazino[1,2-c]pyrimidine- 1,6,8-trione | US10011607, 73
Type:
Small organic molecule
Emp. Form.:
C25H20F2N6O3
Mol. Mass.:
490.4615
SMILES:
Cn1cnc(n1)N1CCN2C(=O)N(C(=O)C[C@@]2(C)C1=O)c1c(F)cc(cc1F)C#Cc1ccccc1
: