Target
Metabotropic glutamate receptor 4
Ligand
BDBM402249
Substrate
Meas. Tech.
Ca2+ Mobilization In Vitro Assay
EC50
104±n/a nM
Citation
 Jaeschke, GO Hara, FPlancher, JRicci, ARueher, DVieira, E Ethynyl derivatives US Patent  US10011607 Publication Date 7/3/2018 
Target
Name:
Metabotropic glutamate receptor 4
Synonyms:
GPRC1D GRM4_HUMAN MGLUR4 Metabotropic glutamate receptor 4 (mGlu4) metabotropic glutamate 4
Type:
Protein
Mol. Mass.:
101899.95
Organism:
Homo sapiens (Human)
Description:
Q14833
Residue:
912
  
Inhibitor
Name:
BDBM402249
Synonyms:
(9aRS)-7-[2-chloro-6-fluoro-4-(2- phenylethynyl)phenyl]-9a- methyl-2-(1-methylpyrazol- 4-yl)-4,9-dihydro-3H- pyrazino[1,2-c]pyrimidine- 1,6,8-trione | US10011607, 77
Type:
Small organic molecule
Emp. Form.:
C26H21ClFN5O3
Mol. Mass.:
505.928
SMILES:
Cn1cc(cn1)N1CCN2C(=O)N(C(=O)CC2(C)C1=O)c1c(F)cc(cc1Cl)C#Cc1ccccc1
: